Information card for entry 7014430
Common name | Strontium Tetrahydroxyberyllate |
Formula | Be H4 O4 Sr |
Calculated formula | Be H4 O4 Sr |
SMILES | [Sr+2].[OH-].[OH-].[Be+2].[OH-].[OH-] |
Title of publication | Structure of the Be(OH)4(2-) anion. |
Authors of publication | Littlefield, Benjamin T. R.; Hinde, Christopher; Weller, Mark T. |
Journal of publication | Dalton transactions (Cambridge, England : 2003) |
Year of publication | 2011 |
Journal volume | 40 |
Journal issue | 4 |
Pages of publication | 782 - 784 |
a | 9.5536 ± 0.0004 Å |
b | 9.5536 ± 0.0004 Å |
c | 17.1539 ± 0.0018 Å |
α | 90° |
β | 90° |
γ | 90° |
Cell volume | 1565.66 ± 0.19 Å3 |
Cell temperature | 293 ± 2 K |
Ambient diffraction temperature | 293 ± 2 K |
Number of distinct elements | 4 |
Space group number | 142 |
Hermann-Mauguin space group symbol | I 41/a c d :2 |
Hall space group symbol | -I 4bd 2c |
Residual factor for all reflections | 0.0514 |
Residual factor for significantly intense reflections | 0.0314 |
Weighted residual factors for significantly intense reflections | 0.0865 |
Weighted residual factors for all reflections included in the refinement | 0.1059 |
Goodness-of-fit parameter for all reflections included in the refinement | 1.103 |
Diffraction radiation wavelength | 0.71073 Å |
Diffraction radiation type | MoKα |