Information card for entry 7014432
Formula | C29.5 H34 O2.5 P2 Pt S2 |
Calculated formula | C29.5 H32 O2.5 P2 Pt S2 |
Title of publication | Structure, solution chemistry, antiproliferative actions and protein binding properties of non-conventional platinum(ii) compounds with sulfur and phosphorus donors. |
Authors of publication | Mügge, Carolin; Rothenburger, Claudia; Beyer, Antje; Görls, Helmar; Gabbiani, Chiara; Casini, Angela; Michelucci, Elena; Landini, Ida; Nobili, Stefania; Mini, Enrico; Messori, Luigi; Weigand, Wolfgang |
Journal of publication | Dalton transactions (Cambridge, England : 2003) |
Year of publication | 2011 |
Journal volume | 40 |
Journal issue | 9 |
Pages of publication | 2006 - 2016 |
a | 9.0685 ± 0.0003 Å |
b | 28.1277 ± 0.0009 Å |
c | 12.3952 ± 0.0003 Å |
α | 90° |
β | 103.898 ± 0.002° |
γ | 90° |
Cell volume | 3069.16 ± 0.16 Å3 |
Cell temperature | 183 ± 2 K |
Ambient diffraction temperature | 183 ± 2 K |
Number of distinct elements | 6 |
Space group number | 14 |
Hermann-Mauguin space group symbol | P 1 21/n 1 |
Hall space group symbol | -P 2yn |
Residual factor for all reflections | 0.1072 |
Residual factor for significantly intense reflections | 0.0638 |
Weighted residual factors for significantly intense reflections | 0.1612 |
Weighted residual factors for all reflections included in the refinement | 0.1845 |
Goodness-of-fit parameter for all reflections included in the refinement | 1.014 |
Diffraction radiation wavelength | 0.71073 Å |
Diffraction radiation type | MoKα |