Information card for entry 7014818
Formula | C92 H78 Eu N14 |
Calculated formula | C92 H78 Eu N14 |
Title of publication | Sandwich-type mixed (phthalocyaninato)(porphyrinato) rare earth double-decker complexes with decreased molecular symmetry of Cs: single crystal structure and self-assembled nano-structure. |
Authors of publication | Wu, Xingcui; Lv, Wei; Wang, Quanbo; Wang, Hailong; Zhang, Xiaomei; Jiang, Jianzhuang |
Journal of publication | Dalton transactions (Cambridge, England : 2003) |
Year of publication | 2011 |
Journal volume | 40 |
Journal issue | 1 |
Pages of publication | 107 - 113 |
a | 33.355 ± 0.003 Å |
b | 72.867 ± 0.007 Å |
c | 12.9923 ± 0.0015 Å |
α | 90° |
β | 90° |
γ | 90° |
Cell volume | 31578 ± 6 Å3 |
Cell temperature | 298 ± 2 K |
Ambient diffraction temperature | 298 ± 2 K |
Number of distinct elements | 4 |
Space group number | 43 |
Hermann-Mauguin space group symbol | F d d 2 |
Hall space group symbol | F 2 -2d |
Residual factor for all reflections | 0.1209 |
Residual factor for significantly intense reflections | 0.0817 |
Weighted residual factors for significantly intense reflections | 0.2033 |
Weighted residual factors for all reflections included in the refinement | 0.2369 |
Goodness-of-fit parameter for all reflections included in the refinement | 1.035 |
Diffraction radiation wavelength | 0.71073 Å |
Diffraction radiation type | MoKα |