Information card for entry 7014993
Formula | C32 H104 Ce4 N24 Se15 Sn4 |
Calculated formula | C32 H104 Ce4 N24 Se15 Sn4 |
Title of publication | Effects of lanthanide metal size and amino ligand denticity on the solvothermal systems Ln/Sn/Se/en and Ln/Sn/Se/dien (Ln = lanthanide) |
Authors of publication | Liang, Jingjing; Chen, Jiangfang; Zhao, Jing; Pan, Yingli; Zhang, Yong; Jia, Dingxian |
Journal of publication | Dalton Transactions |
Year of publication | 2011 |
Journal volume | 40 |
Journal issue | 11 |
Pages of publication | 2631 |
a | 10.2333 ± 0.0006 Å |
b | 13.079 ± 0.0009 Å |
c | 15.7663 ± 0.0009 Å |
α | 80.422 ± 0.004° |
β | 73.738 ± 0.003° |
γ | 88.376 ± 0.004° |
Cell volume | 1997.1 ± 0.2 Å3 |
Cell temperature | 223 ± 2 K |
Ambient diffraction temperature | 223 ± 2 K |
Number of distinct elements | 6 |
Space group number | 2 |
Hermann-Mauguin space group symbol | P -1 |
Hall space group symbol | -P 1 |
Residual factor for all reflections | 0.0531 |
Residual factor for significantly intense reflections | 0.0399 |
Weighted residual factors for significantly intense reflections | 0.073 |
Weighted residual factors for all reflections included in the refinement | 0.0771 |
Goodness-of-fit parameter for all reflections included in the refinement | 0.938 |
Diffraction radiation wavelength | 0.71073 Å |
Diffraction radiation type | MoKα |