Information card for entry 7015000
Formula | C17 H19 Cr O6 P |
Calculated formula | C17 H19 Cr O6 P |
SMILES | [C@@H]1(C)O[P@]1(C1(C(=C(C(=C1C)C)C)C)C)[Cr](C#[O])(C#[O])(C#[O])(C#[O])C#[O].[C@H]1(C)O[P@@]1(C1(C(=C(C(=C1C)C)C)C)C)[Cr](C#[O])(C#[O])(C#[O])(C#[O])C#[O] |
Title of publication | First examples of oxaphosphirane pentacarbonylchromium(0) and -molybdenum(0) complexes: synthesis, structures and reactions |
Authors of publication | Albrecht, Carolin; Bode, Maren; Pérez, Janaina Marinas; Daniels, Jörg; Schnakenburg, Gregor; Streubel, Rainer |
Journal of publication | Dalton Transactions |
Year of publication | 2011 |
Journal volume | 40 |
Journal issue | 11 |
Pages of publication | 2654 |
a | 9.2548 ± 0.0004 Å |
b | 13.447 ± 0.0009 Å |
c | 15.312 ± 0.0009 Å |
α | 87.438 ± 0.003° |
β | 86.721 ± 0.004° |
γ | 88.908 ± 0.004° |
Cell volume | 1900.29 ± 0.19 Å3 |
Cell temperature | 123 ± 2 K |
Ambient diffraction temperature | 123 ± 2 K |
Number of distinct elements | 5 |
Space group number | 2 |
Hermann-Mauguin space group symbol | P -1 |
Hall space group symbol | -P 1 |
Residual factor for all reflections | 0.0948 |
Residual factor for significantly intense reflections | 0.0572 |
Weighted residual factors for significantly intense reflections | 0.137 |
Weighted residual factors for all reflections included in the refinement | 0.1496 |
Goodness-of-fit parameter for all reflections included in the refinement | 1.03 |
Diffraction radiation wavelength | 0.71073 Å |
Diffraction radiation type | MoKα |