Information card for entry 7015002
Formula | C19 H23 Cr O6 P |
Calculated formula | C19 H23 Cr O6 P |
Title of publication | First examples of oxaphosphirane pentacarbonylchromium(0) and -molybdenum(0) complexes: synthesis, structures and reactions |
Authors of publication | Albrecht, Carolin; Bode, Maren; Pérez, Janaina Marinas; Daniels, Jörg; Schnakenburg, Gregor; Streubel, Rainer |
Journal of publication | Dalton Transactions |
Year of publication | 2011 |
Journal volume | 40 |
Journal issue | 11 |
Pages of publication | 2654 |
a | 8.6335 ± 0.0004 Å |
b | 10.2535 ± 0.0005 Å |
c | 11.938 ± 0.0006 Å |
α | 94.29 ± 0.002° |
β | 96.136 ± 0.002° |
γ | 90.618 ± 0.002° |
Cell volume | 1047.61 ± 0.09 Å3 |
Cell temperature | 100 ± 2 K |
Ambient diffraction temperature | 100 ± 2 K |
Number of distinct elements | 5 |
Space group number | 2 |
Hermann-Mauguin space group symbol | P -1 |
Hall space group symbol | -P 1 |
Residual factor for all reflections | 0.0597 |
Residual factor for significantly intense reflections | 0.0584 |
Weighted residual factors for significantly intense reflections | 0.1421 |
Weighted residual factors for all reflections included in the refinement | 0.143 |
Goodness-of-fit parameter for all reflections included in the refinement | 1.067 |
Diffraction radiation wavelength | 0.71073 Å |
Diffraction radiation type | MoKα |