Information card for entry 7015010
Formula | C17 H29 Mo O6 P Si2 |
Calculated formula | C17 H29 Mo O6 P Si2 |
SMILES | C1(C(C)(C)C)O[P]1(C([Si](C)(C)C)[Si](C)(C)C)[Mo](C#[O])(C#[O])(C#[O])(C#[O])C#[O] |
Title of publication | First examples of oxaphosphirane pentacarbonylchromium(0) and -molybdenum(0) complexes: synthesis, structures and reactions |
Authors of publication | Albrecht, Carolin; Bode, Maren; Pérez, Janaina Marinas; Daniels, Jörg; Schnakenburg, Gregor; Streubel, Rainer |
Journal of publication | Dalton Transactions |
Year of publication | 2011 |
Journal volume | 40 |
Journal issue | 11 |
Pages of publication | 2654 |
a | 9.5254 ± 0.0002 Å |
b | 18.8531 ± 0.0007 Å |
c | 13.6767 ± 0.0003 Å |
α | 90° |
β | 91.3656 ± 0.0015° |
γ | 90° |
Cell volume | 2455.41 ± 0.12 Å3 |
Cell temperature | 123 ± 2 K |
Ambient diffraction temperature | 123 ± 2 K |
Number of distinct elements | 6 |
Space group number | 14 |
Hermann-Mauguin space group symbol | P 1 21/n 1 |
Hall space group symbol | -P 2yn |
Residual factor for all reflections | 0.0303 |
Residual factor for significantly intense reflections | 0.0231 |
Weighted residual factors for significantly intense reflections | 0.0559 |
Weighted residual factors for all reflections included in the refinement | 0.0581 |
Goodness-of-fit parameter for all reflections included in the refinement | 1.043 |
Diffraction radiation wavelength | 0.71073 Å |
Diffraction radiation type | MoKα |