Information card for entry 7015743
Formula | C84 H80 B2 Co5 F14 N30 O16 S6 Si |
Calculated formula | C84 H60 B2 Co5 F14 N30 O6 S6 Si |
Title of publication | Complexes of functionally modified hydrazone ligands‒square, rectangular (M4), trigonal bipyramidal (M5) and pin-wheel (M6) motifs. |
Authors of publication | Anwar, Muhammad U.; Elliott, Andrew S.; Thompson, Laurence K.; Dawe, Louise N. |
Journal of publication | Dalton transactions (Cambridge, England : 2003) |
Year of publication | 2011 |
Journal volume | 40 |
Journal issue | 17 |
Pages of publication | 4623 - 4635 |
a | 13.1328 ± 0.0012 Å |
b | 29.758 ± 0.003 Å |
c | 27.266 ± 0.003 Å |
α | 90° |
β | 104.666 ± 0.002° |
γ | 90° |
Cell volume | 10308.5 ± 1.8 Å3 |
Cell temperature | 158 ± 2 K |
Ambient diffraction temperature | 158 ± 2 K |
Number of distinct elements | 9 |
Space group number | 14 |
Hermann-Mauguin space group symbol | P 1 21/c 1 |
Hall space group symbol | -P 2ybc |
Residual factor for all reflections | 0.1152 |
Residual factor for significantly intense reflections | 0.0965 |
Weighted residual factors for significantly intense reflections | 0.2134 |
Weighted residual factors for all reflections included in the refinement | 0.2244 |
Goodness-of-fit parameter for all reflections included in the refinement | 1.142 |
Diffraction radiation wavelength | 0.71075 Å |
Diffraction radiation type | MoKα |