Information card for entry 7015824
Formula | C16 H14 Cl In N6 S2 |
Calculated formula | C16 H14 Cl In N6 S2 |
SMILES | [In]123(SC(NC)=N[N]2=C2C(=[N]3N=C(S1)NC)c1c3c2cccc3ccc1)Cl |
Title of publication | Fluorescent gallium and indium bis(thiosemicarbazonates) and their radiolabelled analogues: Synthesis, structures and cellular confocal fluorescence imaging investigations. |
Authors of publication | Arrowsmith, Rory L.; Waghorn, Philip A.; Jones, Michael W.; Bauman, Andreas; Brayshaw, Simon K.; Hu, Zhiyuan; Kociok-Köhn, Gabriele; Mindt, Thomas L.; Tyrrell, Rex M.; Botchway, Stanley W.; Dilworth, Jonathan R.; Pascu, Sofia I. |
Journal of publication | Dalton transactions (Cambridge, England : 2003) |
Year of publication | 2011 |
Journal volume | 40 |
Journal issue | 23 |
Pages of publication | 6238 - 6252 |
a | 13.7789 ± 0.0006 Å |
b | 28.9035 ± 0.0017 Å |
c | 17.8248 ± 0.0011 Å |
α | 90° |
β | 90° |
γ | 90° |
Cell volume | 7098.9 ± 0.7 Å3 |
Cell temperature | 150 ± 2 K |
Ambient diffraction temperature | 150 ± 2 K |
Number of distinct elements | 6 |
Space group number | 60 |
Hermann-Mauguin space group symbol | P n c a |
Hall space group symbol | -P 2a 2n |
Residual factor for all reflections | 0.1868 |
Residual factor for significantly intense reflections | 0.1062 |
Weighted residual factors for significantly intense reflections | 0.1747 |
Weighted residual factors for all reflections included in the refinement | 0.1982 |
Goodness-of-fit parameter for all reflections included in the refinement | 1.147 |
Diffraction radiation wavelength | 0.71073 Å |
Diffraction radiation type | MoKα |