Information card for entry 7016266
Common name | HB(C3H3N2)3Zr(N(CH3)2)2NH2B(C6F5)3 CH2Cl2 |
Formula | C32 H26 B2 Cl2 F15 N9 Zr |
Calculated formula | C32 H26 B2 Cl2 F15 N9 Zr |
SMILES | [Zr]12([n]3n([BH](n4[n]1ccc4)n1[n]2ccc1)ccc3)(N(C)C)(N(C)C)[NH2][B](c1c(F)c(F)c(F)c(F)c1F)(c1c(F)c(F)c(F)c(F)c1F)c1c(F)c(F)c(F)c(F)c1F.C(Cl)Cl |
Title of publication | Tris(pyrazolyl)borate amidoborane complexes of the group 4 metals. |
Authors of publication | Fuller, Anna-Marie; Hughes, David L.; Lancaster, Simon J. |
Journal of publication | Dalton transactions (Cambridge, England : 2003) |
Year of publication | 2011 |
Journal volume | 40 |
Journal issue | 28 |
Pages of publication | 7434 - 7441 |
a | 12.924 ± 0.0002 Å |
b | 23.2383 ± 0.0003 Å |
c | 13.4537 ± 0.0003 Å |
α | 90° |
β | 103.201 ± 0.002° |
γ | 90° |
Cell volume | 3933.8 ± 0.12 Å3 |
Cell temperature | 140 ± 1 K |
Ambient diffraction temperature | 140 ± 1 K |
Number of distinct elements | 7 |
Space group number | 14 |
Hermann-Mauguin space group symbol | P 1 21/n 1 |
Hall space group symbol | -P 2yn |
Residual factor for all reflections | 0.059 |
Residual factor for significantly intense reflections | 0.0317 |
Weighted residual factors for significantly intense reflections | 0.0698 |
Weighted residual factors for all reflections included in the refinement | 0.078 |
Goodness-of-fit parameter for all reflections included in the refinement | 0.956 |
Diffraction radiation wavelength | 0.71073 Å |
Diffraction radiation type | Mo-Kα |