Information card for entry 7017140
Formula | C96 H84 Dy4 N8 O36 |
Calculated formula | C96 H84 Dy4 N8 O36 |
SMILES | C1(=C2C(CCC2)=[O][Dy]234([OH]5[Dy]678([OH]9[Dy]%10%115([OH]3[Dy]359([OH]46)([O]=C(C4=C(CCC4)O3)c3c(cccc3)N(=O)=O)[O]=C(C3=C(O5)CCC3)c3c(N(=O)=O)cccc3)([O]=C(C3=C(CCC3)O%10)c3c(cccc3)N(=O)=O)[O]=C(C3=C(O%11)CCC3)c3c(N(=O)=O)cccc3)([O]=C(C3=C(CCC3)O7)c3c(cccc3)N(=O)=O)[O]=C(C3=C(O8)CCC3)c3c(N(=O)=O)cccc3)(O1)[O]=C(C1=C(O2)CCC1)c1c(N(=O)=O)cccc1)c1c(cccc1)N(=O)=O |
Title of publication | Systematic study of the formation of the lanthanoid cubane cluster motif mediated by steric modification of diketonate ligands. |
Authors of publication | Andrews, Philip C.; Gee, William J.; Junk, Peter C.; Maclellan, Jonathan G. |
Journal of publication | Dalton transactions (Cambridge, England : 2003) |
Year of publication | 2011 |
Journal volume | 40 |
Journal issue | 45 |
Pages of publication | 12169 - 12179 |
a | 17.125 ± 0.002 Å |
b | 17.125 ± 0.002 Å |
c | 15.993 ± 0.003 Å |
α | 90° |
β | 90° |
γ | 90° |
Cell volume | 4690.2 ± 1.2 Å3 |
Cell temperature | 100 ± 2 K |
Ambient diffraction temperature | 100 ± 2 K |
Number of distinct elements | 5 |
Space group number | 114 |
Hermann-Mauguin space group symbol | P -4 21 c |
Hall space group symbol | P -4 2n |
Residual factor for all reflections | 0.0211 |
Residual factor for significantly intense reflections | 0.0207 |
Weighted residual factors for significantly intense reflections | 0.0517 |
Weighted residual factors for all reflections included in the refinement | 0.0519 |
Goodness-of-fit parameter for all reflections included in the refinement | 1.078 |
Diffraction radiation wavelength | 0.773748 Å |
Diffraction radiation type | synchrotron |