Information card for entry 7017354
Formula | C50 H34 Cd N4 O17 |
Calculated formula | C50 H34 Cd N4 O17 |
Title of publication | Six new metal-organic frameworks with multi-carboxylic acids and imidazole-based spacers: syntheses, structures and properties. |
Authors of publication | Wang, Feng; Ke, Xiaohuan; Zhao, Jinbo; Deng, Kejian; Leng, Xiaoke; Tian, Zhengfang; Wen, Lili; Li, Dongfeng |
Journal of publication | Dalton transactions (Cambridge, England : 2003) |
Year of publication | 2011 |
Journal volume | 40 |
Journal issue | 44 |
Pages of publication | 11856 - 11865 |
a | 28.498 ± 0.003 Å |
b | 11.7312 ± 0.0011 Å |
c | 12.4676 ± 0.0012 Å |
α | 90° |
β | 95.487 ± 0.002° |
γ | 90° |
Cell volume | 4149 ± 0.7 Å3 |
Cell temperature | 298 ± 2 K |
Ambient diffraction temperature | 298 ± 2 K |
Number of distinct elements | 5 |
Space group number | 15 |
Hermann-Mauguin space group symbol | C 1 2/c 1 |
Hall space group symbol | -C 2yc |
Residual factor for all reflections | 0.057 |
Residual factor for significantly intense reflections | 0.045 |
Weighted residual factors for significantly intense reflections | 0.0868 |
Weighted residual factors for all reflections included in the refinement | 0.0909 |
Goodness-of-fit parameter for all reflections included in the refinement | 0.972 |
Diffraction radiation wavelength | 0.71073 Å |
Diffraction radiation type | MoKα |