Information card for entry 7018531
Formula | C21 H15 Cl2 Cu2 N9 O8 |
Calculated formula | C21 H15 Cl2 Cu2 N9 O8 |
Title of publication | Copper perchlorate and tetrafluoridoborate compounds with the ligand 1,4,5-triazanaphthalene. Gradual transformation of mononuclear Cu(ii) compounds via polynuclear mixed-valence Cu(ii)/Cu(i) species to dinuclear Cu(i); syntheses, characterizations and X-ray structures. |
Authors of publication | van Albada, Gerard A.; Mutikainen, Ilpo; Ghazzali, Mohamed; Al-Farhan, Khalid; Reedijk, Jan |
Journal of publication | Dalton transactions (Cambridge, England : 2003) |
Year of publication | 2012 |
Journal volume | 41 |
Journal issue | 15 |
Pages of publication | 4566 - 4574 |
a | 22.055 ± 0.004 Å |
b | 9.121 ± 0.002 Å |
c | 20.513 ± 0.004 Å |
α | 90° |
β | 142.65 ± 0.01° |
γ | 90° |
Cell volume | 2503.5 ± 1 Å3 |
Cell temperature | 173 ± 2 K |
Ambient diffraction temperature | 173 ± 2 K |
Number of distinct elements | 6 |
Space group number | 15 |
Hermann-Mauguin space group symbol | C 1 2/c 1 |
Hall space group symbol | -C 2yc |
Residual factor for all reflections | 0.0907 |
Residual factor for significantly intense reflections | 0.0597 |
Weighted residual factors for significantly intense reflections | 0.1488 |
Weighted residual factors for all reflections included in the refinement | 0.171 |
Goodness-of-fit parameter for all reflections included in the refinement | 1.024 |
Diffraction radiation wavelength | 0.71073 Å |
Diffraction radiation type | MoKα |