Information card for entry 7018533
Formula | C23 H14 Co N O4 |
Calculated formula | C23 H14 Co N O4 |
Title of publication | A series of isostructural mesoporous metal-organic frameworks obtained by ion-exchange induced single-crystal to single-crystal transformation. |
Authors of publication | Yao, Qingxia; Sun, Junliang; Li, Kuo; Su, Jie; Peskov, Maxim V.; Zou, Xiaodong |
Journal of publication | Dalton transactions (Cambridge, England : 2003) |
Year of publication | 2012 |
Journal volume | 41 |
Journal issue | 14 |
Pages of publication | 3953 - 3955 |
a | 27.6523 ± 0.0006 Å |
b | 27.6523 ± 0.0006 Å |
c | 27.6523 ± 0.0006 Å |
α | 90° |
β | 90° |
γ | 90° |
Cell volume | 21144.3 ± 0.8 Å3 |
Cell temperature | 293 ± 2 K |
Ambient diffraction temperature | 293 ± 2 K |
Number of distinct elements | 5 |
Space group number | 223 |
Hermann-Mauguin space group symbol | P m -3 n |
Hall space group symbol | -P 4n 2 3 |
Residual factor for all reflections | 0.1171 |
Residual factor for significantly intense reflections | 0.0834 |
Weighted residual factors for significantly intense reflections | 0.2195 |
Weighted residual factors for all reflections included in the refinement | 0.2487 |
Goodness-of-fit parameter for all reflections included in the refinement | 1.064 |
Diffraction radiation wavelength | 0.71073 Å |
Diffraction radiation type | MoKα |