Information card for entry 7019428
Chemical name | [1,3,5,7-tetrakis(1,2,4-triazol-4-yl)adamantane]silver(I) Nitrate, Solvate with 3.5 Water |
Formula | C18 H27 Ag N13 O6.5 |
Calculated formula | C18 H27 Ag N13 O6.5 |
Title of publication | 1,2,4-Triazole functionalized adamantanes: a new library of polydentate tectons for designing structures of coordination polymers. |
Authors of publication | Senchyk, Ganna A.; Lysenko, Andrey B.; Boldog, Ishtvan; Rusanov, Eduard B.; Chernega, Alexander N.; Krautscheid, Harald; Domasevitch, Konstantin V. |
Journal of publication | Dalton transactions (Cambridge, England : 2003) |
Year of publication | 2012 |
Journal volume | 41 |
Journal issue | 28 |
Pages of publication | 8675 - 8689 |
a | 11.9308 ± 0.0012 Å |
b | 18.9239 ± 0.0012 Å |
c | 22.4189 ± 0.0015 Å |
α | 90° |
β | 90° |
γ | 90° |
Cell volume | 5061.7 ± 0.7 Å3 |
Cell temperature | 296 ± 2 K |
Ambient diffraction temperature | 296 ± 2 K |
Number of distinct elements | 5 |
Space group number | 60 |
Hermann-Mauguin space group symbol | P b c n |
Hall space group symbol | -P 2n 2ab |
Residual factor for all reflections | 0.1094 |
Residual factor for significantly intense reflections | 0.0541 |
Weighted residual factors for significantly intense reflections | 0.1325 |
Weighted residual factors for all reflections included in the refinement | 0.1534 |
Goodness-of-fit parameter for all reflections included in the refinement | 1.031 |
Diffraction radiation wavelength | 0.71073 Å |
Diffraction radiation type | MoKα |