Information card for entry 7019432
Common name | (((NO)AlCl(thf)2)I(thf)2) |
Formula | C20 H34 Al I N2 O4 |
Calculated formula | C20 H34 Al I N2 O4 |
Title of publication | The synthesis and characterization of mono and dinuclear group 13 complexes derived from a Schiff base. |
Authors of publication | Aprile, Antonino; Wilson, David D. J.; Richards, Anne F. |
Journal of publication | Dalton transactions (Cambridge, England : 2003) |
Year of publication | 2012 |
Journal volume | 41 |
Journal issue | 28 |
Pages of publication | 8550 - 8555 |
a | 12.784 ± 0.001 Å |
b | 14.1352 ± 0.0009 Å |
c | 29.117 ± 0.002 Å |
α | 90° |
β | 97.139 ± 0.007° |
γ | 90° |
Cell volume | 5220.8 ± 0.6 Å3 |
Cell temperature | 173 ± 2 K |
Ambient diffraction temperature | 173 ± 2 K |
Number of distinct elements | 6 |
Space group number | 15 |
Hermann-Mauguin space group symbol | C 1 2/c 1 |
Hall space group symbol | -C 2yc |
Residual factor for all reflections | 0.0544 |
Residual factor for significantly intense reflections | 0.0483 |
Weighted residual factors for significantly intense reflections | 0.1395 |
Weighted residual factors for all reflections included in the refinement | 0.1458 |
Goodness-of-fit parameter for all reflections included in the refinement | 1.071 |
Diffraction radiation wavelength | 1.54184 Å |
Diffraction radiation type | CuKα |