Information card for entry 7020802
Formula | C20 H42 Ni2 P2 S4 |
Calculated formula | C20 H42 Ni2 P2 S4 |
Title of publication | Synthesis and chemistry of bis(triisopropylphosphine) nickel(i) and nickel(0) precursors. |
Authors of publication | Beck, Robert; Shoshani, Manar; Krasinkiewicz, Jonathan; Hatnean, Jillian A.; Johnson, Samuel A. |
Journal of publication | Dalton transactions (Cambridge, England : 2003) |
Year of publication | 2013 |
Journal volume | 42 |
Journal issue | 5 |
Pages of publication | 1461 - 1475 |
a | 7.6433 ± 0.0015 Å |
b | 11.11 ± 0.002 Å |
c | 17.163 ± 0.003 Å |
α | 87.22 ± 0.03° |
β | 79.83 ± 0.03° |
γ | 71.63 ± 0.02° |
Cell volume | 1361.4 ± 0.5 Å3 |
Cell temperature | 173.15 K |
Ambient diffraction temperature | 173.15 K |
Number of distinct elements | 5 |
Space group number | 2 |
Hermann-Mauguin space group symbol | P -1 |
Hall space group symbol | -P 1 |
Residual factor for all reflections | 0.0999 |
Residual factor for significantly intense reflections | 0.0579 |
Weighted residual factors for significantly intense reflections | 0.0934 |
Weighted residual factors for all reflections included in the refinement | 0.1091 |
Goodness-of-fit parameter for all reflections included in the refinement | 0.981 |
Diffraction radiation wavelength | 0.71073 Å |
Diffraction radiation type | MoKα |