Information card for entry 7021862
Formula | C16 H12 N2 O2 Pd |
Calculated formula | C16 H12 N2 O2 Pd |
SMILES | c12c(cccc2)n2[n]([Pd]31Oc1c(cccc1)C=[O]3)ccc2 |
Title of publication | New cyclometallated precursors of unsubstituted N-phenylpyrazole [{Pd(phpz)(μ-X)}2] (X = AcO or OH) and study of their reactivity towards selected ligands. |
Authors of publication | Serrano, José Luis; García, Luis; Pérez, José; Pérez, Eduardo; Galiana, José Miguel; García, Joaquín; Martínez, Marina; Sánchez, Gregorio; da Silva, Ivan |
Journal of publication | Dalton transactions (Cambridge, England : 2003) |
Year of publication | 2011 |
Journal volume | 40 |
Journal issue | 1 |
Pages of publication | 156 - 168 |
a | 14.4947 ± 0.001 Å |
b | 12.1565 ± 0.0009 Å |
c | 15.8097 ± 0.0011 Å |
α | 90° |
β | 99.488 ± 0.001° |
γ | 90° |
Cell volume | 2747.6 ± 0.3 Å3 |
Cell temperature | 100 ± 2 K |
Ambient diffraction temperature | 100 ± 2 K |
Number of distinct elements | 5 |
Space group number | 14 |
Hermann-Mauguin space group symbol | P 1 21/a 1 |
Hall space group symbol | -P 2yab |
Residual factor for all reflections | 0.0627 |
Residual factor for significantly intense reflections | 0.059 |
Weighted residual factors for significantly intense reflections | 0.1362 |
Weighted residual factors for all reflections included in the refinement | 0.1385 |
Goodness-of-fit parameter for all reflections included in the refinement | 1.217 |
Diffraction radiation wavelength | 0.71073 Å |
Diffraction radiation type | MoKα |