Information card for entry 7025288
Formula | C26 H35 F6 N3 O2 P2 |
Calculated formula | C26 H35 F6 N3 O2 P2 |
Title of publication | Novel class of functionalized ionic liquids with grafted CMPO-moieties for actinides and rare-earth elements recovery. |
Authors of publication | Odinets, Irina L.; Sharova, Elena V.; Artyshin, Oleg I.; Lyssenko, Konstantin A.; Nelyubina, Yulia V.; Myasoedova, Galina V.; Molochnikova, Nadezhda P.; Zakharchenro, Elena A. |
Journal of publication | Dalton transactions (Cambridge, England : 2003) |
Year of publication | 2010 |
Journal volume | 39 |
Journal issue | 17 |
Pages of publication | 4170 - 4178 |
a | 5.9341 ± 0.0009 Å |
b | 15.819 ± 0.003 Å |
c | 16.393 ± 0.003 Å |
α | 65.857 ± 0.003° |
β | 88.25 ± 0.004° |
γ | 80.353 ± 0.004° |
Cell volume | 1383.1 ± 0.4 Å3 |
Cell temperature | 100 ± 2 K |
Ambient diffraction temperature | 100 ± 2 K |
Number of distinct elements | 6 |
Space group number | 2 |
Hermann-Mauguin space group symbol | P -1 |
Hall space group symbol | -P 1 |
Residual factor for all reflections | 0.0684 |
Residual factor for significantly intense reflections | 0.0403 |
Weighted residual factors for significantly intense reflections | 0.0639 |
Weighted residual factors for all reflections included in the refinement | 0.0677 |
Goodness-of-fit parameter for all reflections included in the refinement | 1.004 |
Diffraction radiation wavelength | 0.71073 Å |
Diffraction radiation type | MoKα |