Information card for entry 7031807
Formula | C98 H210 Cr6 Dy2 N2 O46 P4 |
Calculated formula | C98.024 H208.674 Cr6 Dy2 N2 O46.006 P4 |
Title of publication | Linking Cr3 triangles through phosphonates and lanthanides: synthetic, structural, magnetic and EPR studies. |
Authors of publication | Zangana, Karzan H.; Pineda, Eufemio Moreno; Vitorica-Yrezabal, Iñigo J; McInnes, Eric J. L.; Winpenny, Richard E. P. |
Journal of publication | Dalton transactions (Cambridge, England : 2003) |
Year of publication | 2014 |
Journal volume | 43 |
Journal issue | 35 |
Pages of publication | 13242 - 13249 |
a | 13.7094 ± 0.0006 Å |
b | 14.0352 ± 0.0005 Å |
c | 23.1626 ± 0.0009 Å |
α | 100.096 ± 0.003° |
β | 100.639 ± 0.003° |
γ | 108.186 ± 0.004° |
Cell volume | 4029.8 ± 0.3 Å3 |
Cell temperature | 150 K |
Ambient diffraction temperature | 150 K |
Number of distinct elements | 7 |
Space group number | 2 |
Hermann-Mauguin space group symbol | P -1 |
Hall space group symbol | -P 1 |
Residual factor for all reflections | 0.09 |
Residual factor for significantly intense reflections | 0.0661 |
Weighted residual factors for significantly intense reflections | 0.1849 |
Weighted residual factors for all reflections included in the refinement | 0.2052 |
Goodness-of-fit parameter for all reflections included in the refinement | 1.082 |
Diffraction radiation wavelength | 0.71073 Å |
Diffraction radiation type | MoKα |