Information card for entry 7031988
Formula | C27 H26 Cl2 N4 O5 Pb |
Calculated formula | C27 H26 Cl2 N4 O5 Pb |
Title of publication | Distinguishable Zn(ii) and Pb(ii) template effects on forming pendant-armed Schiff-base macrocyclic complexes including a remarkable Pb(ii)-π macrocyclic complex. |
Authors of publication | Zhang, Kun; Geng, Jiao; Jin, Chao; Huang, Wei |
Journal of publication | Dalton transactions (Cambridge, England : 2003) |
Year of publication | 2014 |
Journal volume | 43 |
Journal issue | 41 |
Pages of publication | 15351 - 15358 |
a | 20.254 ± 0.008 Å |
b | 10.682 ± 0.003 Å |
c | 13.612 ± 0.004 Å |
α | 90° |
β | 98.762 ± 0.008° |
γ | 90° |
Cell volume | 2910.6 ± 1.7 Å3 |
Cell temperature | 291 ± 2 K |
Ambient diffraction temperature | 291 ± 2 K |
Number of distinct elements | 6 |
Space group number | 12 |
Hermann-Mauguin space group symbol | C 1 2/m 1 |
Hall space group symbol | -C 2y |
Residual factor for all reflections | 0.0777 |
Residual factor for significantly intense reflections | 0.0691 |
Weighted residual factors for significantly intense reflections | 0.1626 |
Weighted residual factors for all reflections included in the refinement | 0.1659 |
Goodness-of-fit parameter for all reflections included in the refinement | 1.08 |
Diffraction radiation wavelength | 0.71073 Å |
Diffraction radiation type | MoKα |