Information card for entry 7032715
Formula | C34 H36 F6 Fe2 N8 O12 S2 |
Calculated formula | C34 H36 F6 Fe2 N8 O12 S2 |
Title of publication | Unraveling the origins of catalyst degradation in non-heme iron-based alkane oxidation. |
Authors of publication | Grau, Michaela; Kyriacou, Andrew; Cabedo Martinez, Fernando; de Wispelaere, Irene M.; White, Andrew J. P.; Britovsek, George J. P. |
Journal of publication | Dalton transactions (Cambridge, England : 2003) |
Year of publication | 2014 |
Journal volume | 43 |
Journal issue | 45 |
Pages of publication | 17108 - 17119 |
a | 9.0685 ± 0.0005 Å |
b | 9.9914 ± 0.0004 Å |
c | 13.1697 ± 0.0005 Å |
α | 104.096 ± 0.003° |
β | 109.381 ± 0.004° |
γ | 98.362 ± 0.004° |
Cell volume | 1057.85 ± 0.09 Å3 |
Cell temperature | 173 K |
Ambient diffraction temperature | 173 K |
Number of distinct elements | 7 |
Space group number | 2 |
Hermann-Mauguin space group symbol | P -1 |
Hall space group symbol | -P 1 |
Residual factor for all reflections | 0.0479 |
Residual factor for significantly intense reflections | 0.0417 |
Weighted residual factors for significantly intense reflections | 0.115 |
Weighted residual factors for all reflections included in the refinement | 0.1193 |
Goodness-of-fit parameter for all reflections included in the refinement | 1.075 |
Diffraction radiation wavelength | 1.54184 Å |
Diffraction radiation type | CuKα |