Information card for entry 7032762
Common name | MOF-205-NH2 |
Chemical name | MOF-205-NH2 |
Formula | C48 H27 N O13 Zn4 |
Calculated formula | C48 H27 N O13 Zn4 |
Title of publication | Gas adsorption properties of highly porous metal-organic frameworks containing functionalized naphthalene dicarboxylate linkers. |
Authors of publication | Sim, Jaeung; Yim, Haneul; Ko, Nakeun; Choi, Sang Beom; Oh, Youjin; Park, Hye Jeong; Park, SangYoun; Kim, Jaheon |
Journal of publication | Dalton transactions (Cambridge, England : 2003) |
Year of publication | 2014 |
Journal volume | 43 |
Journal issue | 48 |
Pages of publication | 18017 - 18024 |
a | 30.31 ± 0.004 Å |
b | 30.31 ± 0.004 Å |
c | 30.31 ± 0.004 Å |
α | 90° |
β | 90° |
γ | 90° |
Cell volume | 27846 ± 6 Å3 |
Cell temperature | 223 ± 2 K |
Ambient diffraction temperature | 223 ± 2 K |
Number of distinct elements | 5 |
Space group number | 223 |
Hermann-Mauguin space group symbol | P m -3 n |
Hall space group symbol | -P 4n 2 3 |
Residual factor for all reflections | 0.0613 |
Residual factor for significantly intense reflections | 0.0549 |
Weighted residual factors for significantly intense reflections | 0.1471 |
Weighted residual factors for all reflections included in the refinement | 0.152 |
Goodness-of-fit parameter for all reflections included in the refinement | 1.093 |
Diffraction radiation wavelength | 0.7 Å |
Diffraction radiation type | synchrotron |