Information card for entry 7032854
Formula | C83 H72 N2 |
Calculated formula | C83 H72 N2 |
Title of publication | Exceptionally efficient catalytic hydrodechlorination of persistent organic pollutants: application of new sterically shielded palladium carbene complexes. |
Authors of publication | Saberov, Vagiz Sh; Evans, Daniel A.; Korotkikh, Nikolai I.; Cowley, Alan H.; Pekhtereva, Tatyana M.; Popov, Anatolii F.; Shvaika, Oles P. |
Journal of publication | Dalton transactions (Cambridge, England : 2003) |
Year of publication | 2014 |
Journal volume | 43 |
Journal issue | 48 |
Pages of publication | 18117 - 18122 |
a | 20.082 ± 0.0011 Å |
b | 12.479 ± 0.0007 Å |
c | 25.495 ± 0.0012 Å |
α | 90° |
β | 95.975 ± 0.003° |
γ | 90° |
Cell volume | 6354.4 ± 0.6 Å3 |
Cell temperature | 133 ± 2 K |
Ambient diffraction temperature | 133 ± 2 K |
Number of distinct elements | 3 |
Space group number | 14 |
Hermann-Mauguin space group symbol | P 1 21/c 1 |
Hall space group symbol | -P 2ybc |
Residual factor for all reflections | 0.1128 |
Residual factor for significantly intense reflections | 0.0668 |
Weighted residual factors for significantly intense reflections | 0.155 |
Weighted residual factors for all reflections included in the refinement | 0.2097 |
Goodness-of-fit parameter for all reflections included in the refinement | 1.039 |
Diffraction radiation wavelength | 0.71073 Å |
Diffraction radiation type | MoKα |