Information card for entry 7032857
Chemical name | cis-diamminetetrachloroplatinum(IV) tris(dimethylformamide) |
Formula | C9 H27 Cl4 N5 O3 Pt |
Calculated formula | C9 H27 Cl4 N5 O3 Pt |
SMILES | [Pt](Cl)(Cl)(Cl)(Cl)([NH3])[NH3].O=CN(C)C.O=CN(C)C.O=CN(C)C |
Title of publication | Oxidative halogenation of cisplatin and carboplatin: synthesis, spectroscopy, and crystal and molecular structures of Pt(IV) prodrugs. |
Authors of publication | Johnstone, Timothy C.; Alexander, Sarah M.; Wilson, Justin J.; Lippard, Stephen J. |
Journal of publication | Dalton transactions (Cambridge, England : 2003) |
Year of publication | 2015 |
Journal volume | 44 |
Journal issue | 1 |
Pages of publication | 119 - 129 |
a | 10.085 ± 0.0004 Å |
b | 12.956 ± 0.0005 Å |
c | 16.0513 ± 0.0006 Å |
α | 90° |
β | 104.918 ± 0.001° |
γ | 90° |
Cell volume | 2026.59 ± 0.14 Å3 |
Cell temperature | 100 ± 2 K |
Ambient diffraction temperature | 100 ± 2 K |
Number of distinct elements | 6 |
Space group number | 14 |
Hermann-Mauguin space group symbol | P 1 21/c 1 |
Hall space group symbol | -P 2ybc |
Residual factor for all reflections | 0.0143 |
Residual factor for significantly intense reflections | 0.013 |
Weighted residual factors for significantly intense reflections | 0.0301 |
Weighted residual factors for all reflections included in the refinement | 0.0305 |
Goodness-of-fit parameter for all reflections included in the refinement | 1.086 |
Diffraction radiation wavelength | 0.71073 Å |
Diffraction radiation type | MoKα |