Information card for entry 7032907
Formula | C16 H10 F3 N O |
Calculated formula | C16 H10 F3 N O |
Title of publication | An expedient approach to synthesize fluorescent 3-substituted 4H-quinolizin-4-ones via (η(4)-vinylketene)-Fe(CO)3 complexes. |
Authors of publication | Rosas-Sánchez, Alfredo; Toscano, Rubén A; López-Cortés, José G; Ortega-Alfaro, M Carmen |
Journal of publication | Dalton transactions (Cambridge, England : 2003) |
Year of publication | 2015 |
Journal volume | 44 |
Journal issue | 2 |
Pages of publication | 578 - 590 |
a | 13.943 ± 0.0015 Å |
b | 12.7966 ± 0.0014 Å |
c | 7.3613 ± 0.0008 Å |
α | 90° |
β | 98.394 ± 0.002° |
γ | 90° |
Cell volume | 1299.4 ± 0.2 Å3 |
Cell temperature | 298 ± 2 K |
Ambient diffraction temperature | 298 ± 2 K |
Number of distinct elements | 5 |
Space group number | 14 |
Hermann-Mauguin space group symbol | P 1 21/c 1 |
Hall space group symbol | -P 2ybc |
Residual factor for all reflections | 0.0929 |
Residual factor for significantly intense reflections | 0.0536 |
Weighted residual factors for significantly intense reflections | 0.1076 |
Weighted residual factors for all reflections included in the refinement | 0.1223 |
Goodness-of-fit parameter for all reflections included in the refinement | 1.037 |
Diffraction radiation wavelength | 0.71073 Å |
Diffraction radiation type | MoKα |