Information card for entry 7032991
Formula | C288 H192 N48 O24 Pd6 |
Calculated formula | C288 H192 N48 O24 Pd6 |
Title of publication | Indistinguishability and distinguishability between amide and ester moieties in the construction and properties of M6L8 octahedral nanocages. |
Authors of publication | Noh, Tae Hwan; Hong, Woosik; Lee, Haeri; Jung, Ok-Sang |
Journal of publication | Dalton transactions (Cambridge, England : 2003) |
Year of publication | 2015 |
Journal volume | 44 |
Journal issue | 2 |
Pages of publication | 787 - 794 |
a | 45.1264 ± 0.0007 Å |
b | 45.1264 ± 0.0007 Å |
c | 27.6353 ± 0.0004 Å |
α | 90° |
β | 90° |
γ | 120° |
Cell volume | 48736.7 ± 1.3 Å3 |
Cell temperature | 296 ± 2 K |
Ambient diffraction temperature | 296 ± 2 K |
Number of distinct elements | 5 |
Space group number | 148 |
Hermann-Mauguin space group symbol | R -3 :H |
Hall space group symbol | -R 3 |
Residual factor for all reflections | 0.1268 |
Residual factor for significantly intense reflections | 0.0549 |
Weighted residual factors for significantly intense reflections | 0.1279 |
Weighted residual factors for all reflections included in the refinement | 0.1348 |
Goodness-of-fit parameter for all reflections included in the refinement | 1.036 |
Diffraction radiation wavelength | 0.71073 Å |
Diffraction radiation type | MoKα |