Information card for entry 7032997
Formula | C3 H4 Br3 Cd N S |
Calculated formula | C3 H4 Br3 Cd N S |
Title of publication | Phase transitions and dielectric properties of a hexagonal ABX3 perovskite-type organic-inorganic hybrid compound: [C3H4NS][CdBr3]. |
Authors of publication | Liao, Wei-Qiang; Ye, Heng-Yun; Zhang, Yi; Xiong, Ren-Gen |
Journal of publication | Dalton transactions (Cambridge, England : 2003) |
Year of publication | 2015 |
Journal volume | 44 |
Journal issue | 23 |
Pages of publication | 10614 - 10620 |
a | 7.6474 ± 0.0015 Å |
b | 17.448 ± 0.004 Å |
c | 6.9242 ± 0.0014 Å |
α | 90° |
β | 90° |
γ | 90° |
Cell volume | 923.9 ± 0.3 Å3 |
Cell temperature | 298 ± 2 K |
Ambient diffraction temperature | 298 ± 2 K |
Number of distinct elements | 6 |
Space group number | 63 |
Hermann-Mauguin space group symbol | C m c m |
Hall space group symbol | -C 2c 2 |
Residual factor for all reflections | 0.0405 |
Residual factor for significantly intense reflections | 0.0352 |
Weighted residual factors for significantly intense reflections | 0.0778 |
Weighted residual factors for all reflections included in the refinement | 0.0802 |
Goodness-of-fit parameter for all reflections included in the refinement | 1.037 |
Diffraction radiation wavelength | 0.71073 Å |
Diffraction radiation type | MoKα |