Information card for entry 7033020
Chemical name | [NpN3]FeBr(THF) |
Formula | C35 H54 Br Fe N4 O P |
Calculated formula | C35 H54 Br Fe N4 O P |
Title of publication | Cleavage of an aryl carbon-nitrogen bond of a phosphazido iron(II) complex promoted by hydride metathesis. |
Authors of publication | Ogawa, Takahiko; Suzuki, Tatsuya; Hein, Nicholas M.; Pick, Fraser S.; Fryzuk, Michael D. |
Journal of publication | Dalton transactions (Cambridge, England : 2003) |
Year of publication | 2015 |
Journal volume | 44 |
Journal issue | 1 |
Pages of publication | 54 - 57 |
a | 17.547 ± 0.005 Å |
b | 10.262 ± 0.005 Å |
c | 20.588 ± 0.005 Å |
α | 90° |
β | 90° |
γ | 90° |
Cell volume | 3707 ± 2 Å3 |
Cell temperature | 90 K |
Ambient diffraction temperature | 90 K |
Number of distinct elements | 7 |
Space group number | 29 |
Hermann-Mauguin space group symbol | P c a 21 |
Hall space group symbol | P 2c -2ac |
Residual factor for all reflections | 0.0712 |
Residual factor for significantly intense reflections | 0.0472 |
Weighted residual factors for significantly intense reflections | 0.1014 |
Weighted residual factors for all reflections included in the refinement | 0.1105 |
Goodness-of-fit parameter for all reflections included in the refinement | 1.022 |
Diffraction radiation wavelength | 0.71069 Å |
Diffraction radiation type | MoKα |