Information card for entry 7033029
Formula | C38 H32 N10 Ni2 O4 Zn |
Calculated formula | C38 H32 N10 Ni2 O4 Zn |
Title of publication | Influence of the central metal ion in controlling the self-assembly and magnetic properties of 2D coordination polymers derived from [(NiL)2M](2+) nodes (M = Ni, Zn and Cd) (H2L = salen-type di-Schiff base) and dicyanamide spacers. |
Authors of publication | Das, Lakshmi Kanta; Gómez-García, Carlos J; Ghosh, Ashutosh |
Journal of publication | Dalton transactions (Cambridge, England : 2003) |
Year of publication | 2015 |
Journal volume | 44 |
Journal issue | 3 |
Pages of publication | 1292 - 1302 |
a | 14.9315 ± 0.0007 Å |
b | 19.8367 ± 0.0009 Å |
c | 12.5335 ± 0.0006 Å |
α | 90° |
β | 90° |
γ | 90° |
Cell volume | 3712.3 ± 0.3 Å3 |
Cell temperature | 293 ± 2 K |
Ambient diffraction temperature | 293 ± 2 K |
Number of distinct elements | 6 |
Space group number | 60 |
Hermann-Mauguin space group symbol | P b c n |
Hall space group symbol | -P 2n 2ab |
Residual factor for all reflections | 0.0375 |
Residual factor for significantly intense reflections | 0.0268 |
Weighted residual factors for significantly intense reflections | 0.0641 |
Weighted residual factors for all reflections included in the refinement | 0.0696 |
Goodness-of-fit parameter for all reflections included in the refinement | 1.066 |
Diffraction radiation wavelength | 0.71073 Å |
Diffraction radiation type | MoKα |