Information card for entry 7033072
Common name | {[Cu(btmx)(Cl)2]n |
Formula | C16 H20 Cl2 Cu N6 |
Calculated formula | C16 H20 Cl2 Cu N6 |
Title of publication | Copper(II) coordination polymers: tunable structures and a different activation effect of hydrogen peroxide for the degradation of methyl orange under visible light irradiation. |
Authors of publication | Liu, Lu; Wu, Dongqing; Zhao, Bei; Han, Xiao; Wu, Jie; Hou, Hongwei; Fan, Yaoting |
Journal of publication | Dalton transactions (Cambridge, England : 2003) |
Year of publication | 2015 |
Journal volume | 44 |
Journal issue | 3 |
Pages of publication | 1406 - 1411 |
a | 13.328 ± 0.003 Å |
b | 14.147 ± 0.003 Å |
c | 9.6681 ± 0.0019 Å |
α | 90° |
β | 101.46 ± 0.03° |
γ | 90° |
Cell volume | 1786.6 ± 0.7 Å3 |
Cell temperature | 293 ± 2 K |
Ambient diffraction temperature | 293 ± 2 K |
Number of distinct elements | 5 |
Space group number | 14 |
Hermann-Mauguin space group symbol | P 1 21/c 1 |
Hall space group symbol | -P 2ybc |
Residual factor for all reflections | 0.0865 |
Residual factor for significantly intense reflections | 0.0772 |
Weighted residual factors for significantly intense reflections | 0.1502 |
Weighted residual factors for all reflections included in the refinement | 0.1566 |
Goodness-of-fit parameter for all reflections included in the refinement | 1.011 |
Diffraction radiation wavelength | 0.71073 Å |
Diffraction radiation type | MoKα |