Information card for entry 7033110
Formula | C24 H34 Cu N4 O14 S2 |
Calculated formula | C24 H34 Cu N4 O14 S2 |
Title of publication | Assembly of three coordination polymers based on a sulfonic-carboxylic ligand showing high proton conductivity. |
Authors of publication | Zhao, Shu-Na; Song, Xue-Zhi; Zhu, Min; Meng, Xing; Wu, Lan-Lan; Song, Shu-Yan; Wang, Cheng; Zhang, Hong-Jie |
Journal of publication | Dalton transactions (Cambridge, England : 2003) |
Year of publication | 2015 |
Journal volume | 44 |
Journal issue | 3 |
Pages of publication | 948 - 954 |
a | 8.6325 ± 0.0009 Å |
b | 12.8807 ± 0.0014 Å |
c | 14.7075 ± 0.0016 Å |
α | 90° |
β | 93.76 ± 0.002° |
γ | 90° |
Cell volume | 1631.8 ± 0.3 Å3 |
Cell temperature | 293 ± 2 K |
Ambient diffraction temperature | 293 ± 2 K |
Number of distinct elements | 6 |
Space group number | 14 |
Hermann-Mauguin space group symbol | P 1 21/n 1 |
Hall space group symbol | -P 2yn |
Residual factor for all reflections | 0.0876 |
Residual factor for significantly intense reflections | 0.052 |
Weighted residual factors for significantly intense reflections | 0.127 |
Weighted residual factors for all reflections included in the refinement | 0.1481 |
Goodness-of-fit parameter for all reflections included in the refinement | 1.064 |
Diffraction radiation wavelength | 0.71073 Å |
Diffraction radiation type | MoKα |