Information card for entry 7033218
Formula | C32 H26 Br N3 Pt |
Calculated formula | C32 H26 Br N3 Pt |
SMILES | [Pt]1(c2c(c3[n]1cccc3)cccc2)(Br)=C1N(Cc2ccccc2)c2c(N1Cc1ccccc1)cccc2 |
Title of publication | Cyclometallated platinum(ii) complexes containing NHC ligands: synthesis, characterization, photophysics and their application as emitters in OLEDs. |
Authors of publication | Solomatina, A. I.; Krupenya, D. V.; Gurzhiy, V. V.; Zlatkin, I.; Pushkarev, A. P.; Bochkarev, M. N.; Besley, N. A.; Bichoutskaia, E.; Tunik, S. P. |
Journal of publication | Dalton transactions (Cambridge, England : 2003) |
Year of publication | 2015 |
Journal volume | 44 |
Journal issue | 16 |
Pages of publication | 7152 - 7162 |
a | 11.3481 ± 0.0007 Å |
b | 16.8174 ± 0.0011 Å |
c | 14.9469 ± 0.001 Å |
α | 90° |
β | 106.564 ± 0.001° |
γ | 90° |
Cell volume | 2734.2 ± 0.3 Å3 |
Cell temperature | 210 ± 2 K |
Ambient diffraction temperature | 210 ± 2 K |
Number of distinct elements | 5 |
Space group number | 14 |
Hermann-Mauguin space group symbol | P 1 21/n 1 |
Hall space group symbol | -P 2yn |
Residual factor for all reflections | 0.049 |
Residual factor for significantly intense reflections | 0.0328 |
Weighted residual factors for significantly intense reflections | 0.0886 |
Weighted residual factors for all reflections included in the refinement | 0.0932 |
Goodness-of-fit parameter for all reflections included in the refinement | 0.956 |
Diffraction radiation wavelength | 0.71073 Å |
Diffraction radiation type | MoKα |