Information card for entry 7033251
Formula | C20 H14 Mg N3 O5 |
Calculated formula | C20 H14 Mg N3 O5 |
Title of publication | A robust microporous metal-organic framework as a highly selective and sensitive, instantaneous and colorimetric sensor for Eu³⁺ ions. |
Authors of publication | Gao, Yanfei; Zhang, Xueqiong; Sun, Wei; Liu, Zhiliang |
Journal of publication | Dalton transactions (Cambridge, England : 2003) |
Year of publication | 2015 |
Journal volume | 44 |
Journal issue | 4 |
Pages of publication | 1845 - 1849 |
a | 16.0685 ± 0.0017 Å |
b | 14.6258 ± 0.0012 Å |
c | 9.3457 ± 0.0009 Å |
α | 90° |
β | 117.798 ± 0.008° |
γ | 90° |
Cell volume | 1942.9 ± 0.4 Å3 |
Cell temperature | 153 ± 2 K |
Ambient diffraction temperature | 153 ± 2 K |
Number of distinct elements | 5 |
Space group number | 15 |
Hermann-Mauguin space group symbol | C 1 2/c 1 |
Hall space group symbol | -C 2yc |
Residual factor for all reflections | 0.0787 |
Residual factor for significantly intense reflections | 0.0654 |
Weighted residual factors for significantly intense reflections | 0.1958 |
Weighted residual factors for all reflections included in the refinement | 0.2148 |
Goodness-of-fit parameter for all reflections included in the refinement | 1.073 |
Diffraction radiation wavelength | 0.71073 Å |
Diffraction radiation type | MoKα |