Information card for entry 7033274
Formula | C28 H24.5 N2.5 O5 Re |
Calculated formula | C28 H24.5 N2.5 O5 Re |
Title of publication | Rhenium and technetium complexes that bind to amyloid-β plaques. |
Authors of publication | Hayne, David J.; North, Andrea J.; Fodero-Tavoletti, Michelle; White, Jonathan M.; Hung, Lin W.; Rigopoulos, Angela; McLean, Catriona A.; Adlard, Paul A.; Ackermann, Uwe; Tochon-Danguy, Henri; Villemagne, Victor L.; Barnham, Kevin J.; Donnelly, Paul S. |
Journal of publication | Dalton transactions (Cambridge, England : 2003) |
Year of publication | 2015 |
Journal volume | 44 |
Journal issue | 11 |
Pages of publication | 4933 - 4944 |
a | 10.638 ± 0.0007 Å |
b | 12.5358 ± 0.0007 Å |
c | 19.0696 ± 0.0013 Å |
α | 95.97 ± 0.005° |
β | 96.832 ± 0.005° |
γ | 99.253 ± 0.005° |
Cell volume | 2472.4 ± 0.3 Å3 |
Cell temperature | 130 K |
Ambient diffraction temperature | 130 K |
Number of distinct elements | 5 |
Space group number | 2 |
Hermann-Mauguin space group symbol | P -1 |
Hall space group symbol | -P 1 |
Residual factor for all reflections | 0.0525 |
Residual factor for significantly intense reflections | 0.04 |
Weighted residual factors for significantly intense reflections | 0.0911 |
Weighted residual factors for all reflections included in the refinement | 0.0999 |
Goodness-of-fit parameter for all reflections included in the refinement | 1.095 |
Diffraction radiation wavelength | 1.5418 Å |
Diffraction radiation type | CuKα |