Information card for entry 7033279
Formula | C52 H40.5 Cd2 N4 O12.25 |
Calculated formula | C52 H40.5 Cd2 N4 O12.25 |
Title of publication | Structural diversity and photocatalytic properties of Cd(II) coordination polymers constructed by a flexible V-shaped bipyridyl benzene ligand and dicarboxylate derivatives. |
Authors of publication | Liu, Lei-Lei; Yu, Cai-Xia; Ma, Feng-Ji; Li, Ya-Ru; Han, Jing-Jing; Lin, Lu; Ma, Lu-Fang |
Journal of publication | Dalton transactions (Cambridge, England : 2003) |
Year of publication | 2015 |
Journal volume | 44 |
Journal issue | 4 |
Pages of publication | 1636 - 1645 |
a | 10.266 ± 0.002 Å |
b | 13.899 ± 0.003 Å |
c | 16.102 ± 0.003 Å |
α | 90° |
β | 101.31 ± 0.03° |
γ | 90° |
Cell volume | 2252.9 ± 0.8 Å3 |
Cell temperature | 296 ± 2 K |
Ambient diffraction temperature | 296 ± 2 K |
Number of distinct elements | 5 |
Space group number | 13 |
Hermann-Mauguin space group symbol | P 1 2/c 1 |
Hall space group symbol | -P 2yc |
Residual factor for all reflections | 0.0355 |
Residual factor for significantly intense reflections | 0.0263 |
Weighted residual factors for significantly intense reflections | 0.0573 |
Weighted residual factors for all reflections included in the refinement | 0.0645 |
Goodness-of-fit parameter for all reflections included in the refinement | 1.055 |
Diffraction radiation wavelength | 0.71073 Å |
Diffraction radiation type | MoKα |