Information card for entry 7033327
Formula | C14 H11 Mn N4 O3 |
Calculated formula | C14 H11 Mn N4 O3 |
SMILES | [Mn]1([n]2c(N3C=1N(C=C3)CC)cccc2)(C#[O])(C#[O])(C#[O])C#N |
Title of publication | Exploring the effect of axial ligand substitution (X = Br, NCS, CN) on the photodecomposition and electrochemical activity of [MnX(N-C)(CO)3] complexes. |
Authors of publication | Agarwal, Jay; Stanton Iii, Charles J.; Shaw, Travis W.; Vandezande, Jonathon E.; Majetich, George F.; Bocarsly, Andrew B.; Schaefer Iii, Henry F. |
Journal of publication | Dalton transactions (Cambridge, England : 2003) |
Year of publication | 2015 |
Journal volume | 44 |
Journal issue | 5 |
Pages of publication | 2122 - 2131 |
a | 14.4018 ± 0.0015 Å |
b | 10.6199 ± 0.0011 Å |
c | 9.3898 ± 0.001 Å |
α | 90° |
β | 100.955 ± 0.0017° |
γ | 90° |
Cell volume | 1410 ± 0.3 Å3 |
Cell temperature | 100 ± 2 K |
Ambient diffraction temperature | 100 ± 2 K |
Number of distinct elements | 5 |
Space group number | 14 |
Hermann-Mauguin space group symbol | P 1 21/c 1 |
Hall space group symbol | -P 2ybc |
Residual factor for all reflections | 0.0741 |
Residual factor for significantly intense reflections | 0.0462 |
Weighted residual factors for significantly intense reflections | 0.1063 |
Weighted residual factors for all reflections included in the refinement | 0.1196 |
Goodness-of-fit parameter for all reflections included in the refinement | 1.03 |
Diffraction radiation wavelength | 0.71073 Å |
Diffraction radiation type | MoKα |