Information card for entry 7033345
Formula | C23.7 H49.4 Cu2 F6 N8 O13 S2 |
Calculated formula | C23.7 H48.1 Cu2 F6 N8 O13 S2 |
Title of publication | Mono- and dinuclear metal complexes containing the 1,5,9-triazacyclododecane ([12]aneN3) unit and their interaction with DNA. |
Authors of publication | Medina-Molner, Alfredo; Rohner, Melanie; Pandiarajan, Devaraj; Spingler, Bernhard |
Journal of publication | Dalton transactions (Cambridge, England : 2003) |
Year of publication | 2015 |
Journal volume | 44 |
Journal issue | 8 |
Pages of publication | 3664 - 3672 |
a | 9.3134 ± 0.0008 Å |
b | 12.3928 ± 0.0009 Å |
c | 16.8732 ± 0.0013 Å |
α | 93.869 ± 0.009° |
β | 97.99 ± 0.01° |
γ | 90.512 ± 0.01° |
Cell volume | 1923.9 ± 0.3 Å3 |
Cell temperature | 183 ± 2 K |
Ambient diffraction temperature | 183 ± 2 K |
Number of distinct elements | 7 |
Space group number | 2 |
Hermann-Mauguin space group symbol | P -1 |
Hall space group symbol | -P 1 |
Residual factor for all reflections | 0.0891 |
Residual factor for significantly intense reflections | 0.0612 |
Weighted residual factors for significantly intense reflections | 0.1446 |
Weighted residual factors for all reflections included in the refinement | 0.1561 |
Goodness-of-fit parameter for all reflections included in the refinement | 0.902 |
Diffraction radiation wavelength | 0.71073 Å |
Diffraction radiation type | MoKα |