Information card for entry 7033383
Formula | C78 H92.15 Mn3 N6 O13.08 |
Calculated formula | C78 H90 Mn3 N6 O13.082 |
Title of publication | Structural variations in metal complexes of a tertiary α-hydroxyoxime. |
Authors of publication | D'Alessio, Daniel; Lombardo, Daniel M.; Vaughan, Jamila G.; Skelton, Brian W.; Barnard, Keith R.; Ogden, Mark I. |
Journal of publication | Dalton transactions (Cambridge, England : 2003) |
Year of publication | 2015 |
Journal volume | 44 |
Journal issue | 16 |
Pages of publication | 7163 - 7168 |
a | 15.6069 ± 0.0009 Å |
b | 15.6069 ± 0.0009 Å |
c | 29.9848 ± 0.0015 Å |
α | 90° |
β | 90° |
γ | 120° |
Cell volume | 6325.1 ± 0.6 Å3 |
Cell temperature | 100 ± 2 K |
Ambient diffraction temperature | 100 ± 2 K |
Number of distinct elements | 5 |
Space group number | 148 |
Hermann-Mauguin space group symbol | R -3 :H |
Hall space group symbol | -R 3 |
Residual factor for all reflections | 0.1423 |
Residual factor for significantly intense reflections | 0.0648 |
Weighted residual factors for significantly intense reflections | 0.1559 |
Weighted residual factors for all reflections included in the refinement | 0.1736 |
Goodness-of-fit parameter for all reflections included in the refinement | 0.802 |
Diffraction radiation wavelength | 0.71073 Å |
Diffraction radiation type | MoKα |