Information card for entry 7033389
Chemical name | Bismuch tellurium iodate oxychloride |
Formula | Bi2 Cl I O8 Te |
Calculated formula | Bi2 Cl I O8 Te |
Title of publication | Bi2Te(IO3)O5Cl: a novel polar iodate oxychloride exhibiting a second-order nonlinear optical response. |
Authors of publication | Geng, Lei; Meng, Changyu; Lu, Hongyan; Luo, Zhongzhen; Lin, Chensheng; Cheng, Wendan |
Journal of publication | Dalton transactions (Cambridge, England : 2003) |
Year of publication | 2015 |
Journal volume | 44 |
Journal issue | 5 |
Pages of publication | 2469 - 2475 |
a | 22.037 ± 0.008 Å |
b | 5.2564 ± 0.0017 Å |
c | 15.142 ± 0.005 Å |
α | 90° |
β | 104.499 ± 0.007° |
γ | 90° |
Cell volume | 1698.1 ± 1 Å3 |
Cell temperature | 293 ± 2 K |
Ambient diffraction temperature | 293 ± 2 K |
Number of distinct elements | 5 |
Space group number | 9 |
Hermann-Mauguin space group symbol | C 1 c 1 |
Hall space group symbol | C -2yc |
Residual factor for all reflections | 0.0379 |
Residual factor for significantly intense reflections | 0.0342 |
Weighted residual factors for significantly intense reflections | 0.07 |
Weighted residual factors for all reflections included in the refinement | 0.0713 |
Goodness-of-fit parameter for all reflections included in the refinement | 0.988 |
Diffraction radiation wavelength | 0.71073 Å |
Diffraction radiation type | MoKα |