Information card for entry 7033432
Formula | C22 H14 Mn2 O10 S2 |
Calculated formula | C22 H14 Mn2 O10 S2 |
SMILES | C(#[O])[Mn]1(C#[O])(C#[O])(C#[O])[S](c2ccc(cc2)OC)[Mn](C#[O])(C#[O])([S]1c1ccc(cc1)OC)(C#[O])C#[O] |
Title of publication | Carbon monoxide release properties and molecular structures of phenylthiolatomanganese(i) carbonyl complexes of the type [(OC)4Mn(μ-S-aryl)]2. |
Authors of publication | Mede, Ralf; Lorett-Velásquez, Vaneza Paola; Klein, Moritz; Görls, Helmar; Schmitt, Michael; Gessner, Guido; Heinemann, Stefan H.; Popp, Jürgen; Westerhausen, Matthias |
Journal of publication | Dalton transactions (Cambridge, England : 2003) |
Year of publication | 2015 |
Journal volume | 44 |
Journal issue | 7 |
Pages of publication | 3020 - 3033 |
a | 10.5593 ± 0.0003 Å |
b | 9.4284 ± 0.0003 Å |
c | 12.5227 ± 0.0003 Å |
α | 90° |
β | 102.598 ± 0.002° |
γ | 90° |
Cell volume | 1216.71 ± 0.06 Å3 |
Cell temperature | 133 ± 2 K |
Ambient diffraction temperature | 133 ± 2 K |
Number of distinct elements | 5 |
Space group number | 14 |
Hermann-Mauguin space group symbol | P 1 21/c 1 |
Hall space group symbol | -P 2ybc |
Residual factor for all reflections | 0.0323 |
Residual factor for significantly intense reflections | 0.0279 |
Weighted residual factors for significantly intense reflections | 0.0635 |
Weighted residual factors for all reflections included in the refinement | 0.0654 |
Goodness-of-fit parameter for all reflections included in the refinement | 1.096 |
Diffraction radiation wavelength | 0.71073 Å |
Diffraction radiation type | MoKα |