Information card for entry 7033466
Formula | C25 H24 Fe N O P S |
Calculated formula | C25 H24 Fe N O P S |
SMILES | [Fe]12345678([c]9([cH]1[cH]2[cH]3[cH]49)C(=S)N(C)C)[c]1([cH]8[cH]7[cH]6[cH]51)P(=O)(c1ccccc1)c1ccccc1 |
Title of publication | Synthesis of phosphinoferrocene amides and thioamides from carbamoyl chlorides and the structural chemistry of Group 11 metal complexes with these mixed-donor ligands. |
Authors of publication | Fernandes, Tiago A.; Solařová, Hana; Císařová, Ivana; Uhlík, Filip; Štícha, Martin; Štěpnička, Petr |
Journal of publication | Dalton transactions (Cambridge, England : 2003) |
Year of publication | 2015 |
Journal volume | 44 |
Journal issue | 7 |
Pages of publication | 3092 - 3108 |
a | 8.5443 ± 0.0002 Å |
b | 10.0465 ± 0.0003 Å |
c | 13.2078 ± 0.0003 Å |
α | 87.165 ± 0.001° |
β | 89.785 ± 0.001° |
γ | 71.819 ± 0.001° |
Cell volume | 1075.76 ± 0.05 Å3 |
Cell temperature | 150 ± 2 K |
Ambient diffraction temperature | 150 ± 2 K |
Number of distinct elements | 7 |
Space group number | 2 |
Hermann-Mauguin space group symbol | P -1 |
Hall space group symbol | -P 1 |
Residual factor for all reflections | 0.0302 |
Residual factor for significantly intense reflections | 0.0267 |
Weighted residual factors for significantly intense reflections | 0.0668 |
Weighted residual factors for all reflections included in the refinement | 0.0686 |
Goodness-of-fit parameter for all reflections included in the refinement | 1.06 |
Diffraction radiation wavelength | 0.71073 Å |
Diffraction radiation type | MoKα |