Information card for entry 7033469
Formula | C24 H22 Fe N O P S |
Calculated formula | C24 H22 Fe N O P S |
SMILES | [Fe]12345678([c]9([cH]1[cH]2[cH]3[cH]49)C(=O)NC)[c]1(P(=S)(c2ccccc2)c2ccccc2)[cH]5[cH]6[cH]7[cH]81 |
Title of publication | Synthesis of phosphinoferrocene amides and thioamides from carbamoyl chlorides and the structural chemistry of Group 11 metal complexes with these mixed-donor ligands. |
Authors of publication | Fernandes, Tiago A.; Solařová, Hana; Císařová, Ivana; Uhlík, Filip; Štícha, Martin; Štěpnička, Petr |
Journal of publication | Dalton transactions (Cambridge, England : 2003) |
Year of publication | 2015 |
Journal volume | 44 |
Journal issue | 7 |
Pages of publication | 3092 - 3108 |
a | 11.8032 ± 0.0011 Å |
b | 19.3256 ± 0.0019 Å |
c | 9.6446 ± 0.0008 Å |
α | 90° |
β | 108.311 ± 0.003° |
γ | 90° |
Cell volume | 2088.6 ± 0.3 Å3 |
Cell temperature | 150 ± 2 K |
Ambient diffraction temperature | 150 ± 2 K |
Number of distinct elements | 7 |
Space group number | 7 |
Hermann-Mauguin space group symbol | P 1 c 1 |
Hall space group symbol | P -2yc |
Residual factor for all reflections | 0.0776 |
Residual factor for significantly intense reflections | 0.0487 |
Weighted residual factors for significantly intense reflections | 0.0969 |
Weighted residual factors for all reflections included in the refinement | 0.1089 |
Goodness-of-fit parameter for all reflections included in the refinement | 0.994 |
Diffraction radiation wavelength | 0.71073 Å |
Diffraction radiation type | MoKα |