Information card for entry 7033479
Formula | C19 H24 Cl2 N2 O Zn |
Calculated formula | C19 H24 Cl2 N2 O Zn |
SMILES | [Zn]1(Cl)(Cl)[n]2c(cccc2OC)C=[N]1c1c(cccc1C(C)C)C(C)C |
Title of publication | Synthesis and characterization of substituted Schiff-base ligands and their d(10) metal complexes: structure-induced luminescence tuning behaviors and applications in co-sensitized solar cells. |
Authors of publication | Dong, Yu-Wei; Fan, Rui-Qing; Wang, Ping; Wei, Li-Guo; Wang, Xin-Ming; Zhang, Hui-Jie; Gao, Song; Yang, Yu-Lin; Wang, Yu-Lei |
Journal of publication | Dalton transactions (Cambridge, England : 2003) |
Year of publication | 2015 |
Journal volume | 44 |
Journal issue | 12 |
Pages of publication | 5306 - 5322 |
a | 10.05 ± 0.005 Å |
b | 17.306 ± 0.005 Å |
c | 14.363 ± 0.004 Å |
α | 90° |
β | 124.43 ± 0.016° |
γ | 90° |
Cell volume | 2060.5 ± 1.4 Å3 |
Cell temperature | 153 ± 2 K |
Ambient diffraction temperature | 153 ± 2 K |
Number of distinct elements | 6 |
Space group number | 14 |
Hermann-Mauguin space group symbol | P 1 21/c 1 |
Hall space group symbol | -P 2ybc |
Residual factor for all reflections | 0.052 |
Residual factor for significantly intense reflections | 0.0388 |
Weighted residual factors for significantly intense reflections | 0.0971 |
Weighted residual factors for all reflections included in the refinement | 0.1047 |
Goodness-of-fit parameter for all reflections included in the refinement | 1.004 |
Diffraction radiation wavelength | 0.71073 Å |
Diffraction radiation type | MoKα |