Information card for entry 7033499
Formula | C14 H18 B2 Br6 Fe N6 O6 |
Calculated formula | C14 H18 B2 Br6 Fe N6 O6 |
Title of publication | First iron and cobalt(ii) hexabromoclathrochelates: structural, magnetic, redox, and electrocatalytic behavior. |
Authors of publication | Dolganov, Alexander V.; Belov, Alexander S.; Novikov, Valentin V.; Vologzhanina, Anna V.; Romanenko, Galina V.; Budnikova, Yulia G.; Zelinskii, Genrikh E.; Buzin, Michail I.; Voloshin, Yan Z. |
Journal of publication | Dalton transactions (Cambridge, England : 2003) |
Year of publication | 2015 |
Journal volume | 44 |
Journal issue | 5 |
Pages of publication | 2476 - 2487 |
a | 8.209 ± 0.002 Å |
b | 24.227 ± 0.006 Å |
c | 8.21 ± 0.002 Å |
α | 90° |
β | 119.472 ± 0.003° |
γ | 90° |
Cell volume | 1421.5 ± 0.6 Å3 |
Cell temperature | 280 K |
Ambient diffraction temperature | 280 K |
Number of distinct elements | 7 |
Space group number | 11 |
Hermann-Mauguin space group symbol | P 1 21/m 1 |
Hall space group symbol | -P 2yb |
Residual factor for all reflections | 0.1773 |
Residual factor for significantly intense reflections | 0.0582 |
Weighted residual factors for significantly intense reflections | 0.0997 |
Weighted residual factors for all reflections included in the refinement | 0.1236 |
Goodness-of-fit parameter for all reflections included in the refinement | 0.988 |
Diffraction radiation wavelength | 0.71073 Å |
Diffraction radiation type | MoKα |