Information card for entry 7033516
Formula | C69 H65 B Cl Ni O P3 S2 |
Calculated formula | C69 H65 B Cl Ni O P3 S2 |
Title of publication | Mechanisms and rates of proton transfer to coordinated carboxydithioates: studies on [Ni(S2CR){PhP(CH2CH2PPh2)2}](+) (R = Me, Et, Bu(n) or Ph). |
Authors of publication | Alwaaly, Ahmed; Clegg, William; Henderson, Richard A.; Probert, Michael R.; Waddell, Paul G. |
Journal of publication | Dalton transactions (Cambridge, England : 2003) |
Year of publication | 2015 |
Journal volume | 44 |
Journal issue | 7 |
Pages of publication | 3307 - 3317 |
a | 13.8395 ± 0.0003 Å |
b | 14.8535 ± 0.0004 Å |
c | 15.4286 ± 0.0004 Å |
α | 98.071 ± 0.002° |
β | 106.232 ± 0.002° |
γ | 97.21 ± 0.002° |
Cell volume | 2969.37 ± 0.14 Å3 |
Cell temperature | 150 ± 0.1 K |
Ambient diffraction temperature | 150 ± 0.1 K |
Number of distinct elements | 8 |
Space group number | 2 |
Hermann-Mauguin space group symbol | P -1 |
Hall space group symbol | -P 1 |
Residual factor for all reflections | 0.0608 |
Residual factor for significantly intense reflections | 0.0404 |
Weighted residual factors for significantly intense reflections | 0.0897 |
Weighted residual factors for all reflections included in the refinement | 0.1011 |
Goodness-of-fit parameter for all reflections included in the refinement | 1.026 |
Diffraction radiation wavelength | 0.71073 Å |
Diffraction radiation type | MoKα |