Information card for entry 7033568
Formula | C25 H25 F5 N4 |
Calculated formula | C25 H25 F5 N4 |
SMILES | N(=C\c1[nH]c(C(=c2nc(/C=N/C(C)(C)C)cc2)c2c(F)c(F)c(F)c(F)c2F)cc1)/C(C)(C)C |
Title of publication | Towards dipyrrins: oxidation and metalation of acyclic and macrocyclic Schiff-base dipyrromethanes. |
Authors of publication | Pankhurst, James R.; Cadenbach, Thomas; Betz, Daniel; Finn, Colin; Love, Jason B. |
Journal of publication | Dalton transactions (Cambridge, England : 2003) |
Year of publication | 2015 |
Journal volume | 44 |
Journal issue | 5 |
Pages of publication | 2066 - 2070 |
a | 12.0938 ± 0.0006 Å |
b | 14.2191 ± 0.0011 Å |
c | 14.6822 ± 0.0011 Å |
α | 104.393 ± 0.007° |
β | 90.013 ± 0.005° |
γ | 95.477 ± 0.005° |
Cell volume | 2433.6 ± 0.3 Å3 |
Cell temperature | 173 ± 2 K |
Ambient diffraction temperature | 173 ± 2 K |
Number of distinct elements | 4 |
Space group number | 2 |
Hermann-Mauguin space group symbol | P -1 |
Hall space group symbol | -P 1 |
Residual factor for all reflections | 0.1404 |
Residual factor for significantly intense reflections | 0.0831 |
Weighted residual factors for significantly intense reflections | 0.1487 |
Weighted residual factors for all reflections included in the refinement | 0.1692 |
Goodness-of-fit parameter for all reflections included in the refinement | 1.125 |
Diffraction radiation wavelength | 0.71073 Å |
Diffraction radiation type | MoKα |