Information card for entry 7033588
Formula | C16 H11 Cl N2 O Zn |
Calculated formula | C16 H11 Cl N2 O Zn |
Title of publication | Six Zn(ii) and Cd(ii) coordination polymers assembled from a similar binuclear building unit: tunable structures and luminescence properties. |
Authors of publication | Zhang, Liyan; Rong, Lulu; Hu, Guoli; Jin, Suo; Jia, Wei-Guo; Liu, Ji; Yuan, Guozan |
Journal of publication | Dalton transactions (Cambridge, England : 2003) |
Year of publication | 2015 |
Journal volume | 44 |
Journal issue | 15 |
Pages of publication | 6731 - 6739 |
a | 7.767 ± 0.004 Å |
b | 9.67 ± 0.005 Å |
c | 19.707 ± 0.01 Å |
α | 90° |
β | 98.545 ± 0.01° |
γ | 90° |
Cell volume | 1463.7 ± 1.3 Å3 |
Cell temperature | 173 ± 2 K |
Ambient diffraction temperature | 173 ± 2 K |
Number of distinct elements | 6 |
Space group number | 14 |
Hermann-Mauguin space group symbol | P 1 21/n 1 |
Hall space group symbol | -P 2yn |
Residual factor for all reflections | 0.0858 |
Residual factor for significantly intense reflections | 0.06 |
Weighted residual factors for significantly intense reflections | 0.1823 |
Weighted residual factors for all reflections included in the refinement | 0.2075 |
Goodness-of-fit parameter for all reflections included in the refinement | 1.056 |
Diffraction radiation wavelength | 0.71073 Å |
Diffraction radiation type | MoKα |