Information card for entry 7033598
Formula | C76 H76 Cl2 Mn4 N8 O22 P2 |
Calculated formula | C76 H76 Cl2 Mn4 N8 O22 P2 |
Title of publication | The O-P-O bridged Mn2(salen)2 chains showing coexistence of single chain magnet and metamagnet behaviour. |
Authors of publication | Wang, Ting-Ting; Ren, Min; Bao, Song-Song; Cai, Zhong-Sheng; Liu, Bin; Zheng, Ze-Hua; Xu, Zhong-Li; Zheng, Li-Min |
Journal of publication | Dalton transactions (Cambridge, England : 2003) |
Year of publication | 2015 |
Journal volume | 44 |
Journal issue | 9 |
Pages of publication | 4271 - 4279 |
a | 11.156 ± 0.002 Å |
b | 13.348 ± 0.002 Å |
c | 13.958 ± 0.002 Å |
α | 71.583 ± 0.002° |
β | 78.316 ± 0.002° |
γ | 78.366 ± 0.002° |
Cell volume | 1909.9 ± 0.5 Å3 |
Cell temperature | 163 ± 2 K |
Ambient diffraction temperature | 163 ± 2 K |
Number of distinct elements | 7 |
Space group number | 2 |
Hermann-Mauguin space group symbol | P -1 |
Hall space group symbol | -P 1 |
Residual factor for all reflections | 0.0486 |
Residual factor for significantly intense reflections | 0.039 |
Weighted residual factors for significantly intense reflections | 0.1063 |
Weighted residual factors for all reflections included in the refinement | 0.1125 |
Goodness-of-fit parameter for all reflections included in the refinement | 1.09 |
Diffraction radiation wavelength | 0.71073 Å |
Diffraction radiation type | MoKα |