Information card for entry 7033603
Formula | C26 H16 F9 N5 Pt |
Calculated formula | C26 H16 F9 N5 Pt |
Title of publication | Bidentate NHC^pyrozolate ligands in luminescent platinum(ii) complexes. |
Authors of publication | Naziruddin, Abbas Raja; Galstyan, Anzhela; Iordache, Adriana; Daniliuc, Constantin G.; Strassert, Cristian A.; De Cola, Luisa |
Journal of publication | Dalton transactions (Cambridge, England : 2003) |
Year of publication | 2015 |
Journal volume | 44 |
Journal issue | 18 |
Pages of publication | 8467 - 8477 |
a | 7.5972 ± 0.0001 Å |
b | 22.2707 ± 0.0004 Å |
c | 15.781 ± 0.0004 Å |
α | 90° |
β | 102.385 ± 0.001° |
γ | 90° |
Cell volume | 2607.93 ± 0.09 Å3 |
Cell temperature | 223 ± 2 K |
Ambient diffraction temperature | 223 ± 2 K |
Number of distinct elements | 5 |
Space group number | 14 |
Hermann-Mauguin space group symbol | P 1 21/c 1 |
Hall space group symbol | -P 2ybc |
Residual factor for all reflections | 0.0303 |
Residual factor for significantly intense reflections | 0.0283 |
Weighted residual factors for significantly intense reflections | 0.0711 |
Weighted residual factors for all reflections included in the refinement | 0.0729 |
Goodness-of-fit parameter for all reflections included in the refinement | 1.09 |
Diffraction radiation wavelength | 0.71073 Å |
Diffraction radiation type | MoKα |